RSS

TinyOS 2.x Cygwin Win7 Java Make Error No solution

13 Jun

$ make
… /opt/tinyos-2.x/support/java
make[1]: Entering directory ‘/opt/tinyos-2.x/support/java/net’
… /opt/tinyos-2.x/support/java/net
make[2]: Entering directory ‘/opt/tinyos-2.x/support/java/net/tinyos’
… /opt/tinyos-2.x/support/java/net/tinyos
make[3]: Entering directory ‘/opt/tinyos-2.x/support/java/net/tinyos/packet’
… /opt/tinyos-2.x/support/java/net/tinyos/packet
ncg -o Serial.java -java-classname=net.tinyos.packet.Serial java /opt/tinyos-2.x/tos/lib/serial/Serial.h Serial.h
Couldn’t execute gcc
failed to parse nesC file /opt/tinyos-2.x/tos/lib/serial/Serial.h
Makefile:12: recipe for target ‘Serial.java’ failed
make[3]: *** [Serial.java] Error 1
make[3]: Leaving directory ‘/opt/tinyos-2.x/support/java/net/tinyos/packet’
make[3]: Entering directory ‘/opt/tinyos-2.x/support/java/net/tinyos/message’
… /opt/tinyos-2.x/support/java/net/tinyos/message
mig -o SerialPacket.java -java-classname=net.tinyos.message.SerialPacket java /opt/tinyos-2.x/tos/lib/serial/Serial.h serial_packet -I/opt/tinyos-2.x/tos/types
Couldn’t execute gcc
failed to parse message file /opt/tinyos-2.x/tos/lib/serial/Serial.h
Makefile:12: recipe for target ‘SerialPacket.java’ failed
make[3]: *** [SerialPacket.java] Error 1
make[3]: Leaving directory ‘/opt/tinyos-2.x/support/java/net/tinyos/message’
make[3]: Entering directory ‘/opt/tinyos-2.x/support/java/net/tinyos/sf’
… /opt/tinyos-2.x/support/java/net/tinyos/sf
javac SFWindow.java
make[3]: javac: Command not found
../../../Makefile.include:47: recipe for target ‘SFWindow.class’ failed
make[3]: *** [SFWindow.class] Error 127
make[3]: Leaving directory ‘/opt/tinyos-2.x/support/java/net/tinyos/sf’
make[3]: Entering directory ‘/opt/tinyos-2.x/support/java/net/tinyos/comm’
… /opt/tinyos-2.x/support/java/net/tinyos/comm
javac TOSCommLibraryLoader.java
make[3]: javac: Command not found
../../../Makefile.include:47: recipe for target ‘TOSCommLibraryLoader.class’ failed
make[3]: *** [TOSCommLibraryLoader.class] Error 127
make[3]: Leaving directory ‘/opt/tinyos-2.x/support/java/net/tinyos/comm’
make[3]: Entering directory ‘/opt/tinyos-2.x/support/java/net/tinyos/mviz’
… /opt/tinyos-2.x/support/java/net/tinyos/mviz
javac DMoteModelListener.java
make[3]: javac: Command not found
../../../Makefile.include:47: recipe for target ‘DMoteModelListener.class’ failed
make[3]: *** [DMoteModelListener.class] Error 127
make[3]: Leaving directory ‘/opt/tinyos-2.x/support/java/net/tinyos/mviz’
make[3]: Entering directory ‘/opt/tinyos-2.x/support/java/net/tinyos/sim’
… /opt/tinyos-2.x/support/java/net/tinyos/sim
javac LinkLayerModel.java
make[3]: javac: Command not found
../../../Makefile.include:47: recipe for target ‘LinkLayerModel.class’ failed
make[3]: *** [LinkLayerModel.class] Error 127
make[3]: Leaving directory ‘/opt/tinyos-2.x/support/java/net/tinyos/sim’
make[3]: Entering directory ‘/opt/tinyos-2.x/support/java/net/tinyos/tools’
… /opt/tinyos-2.x/support/java/net/tinyos/tools
mig java -java-classname=net.tinyos.tools.PrintfMsg /opt/tinyos-2.x/tos/lib/printf/printf.h printf_msg -o PrintfMsg.java
Couldn’t execute gcc
failed to parse message file /opt/tinyos-2.x/tos/lib/printf/printf.h
Makefile:16: recipe for target ‘PrintfMsg.java’ failed
make[3]: *** [PrintfMsg.java] Error 1
make[3]: Leaving directory ‘/opt/tinyos-2.x/support/java/net/tinyos/tools’
make[3]: Entering directory ‘/opt/tinyos-2.x/support/java/net/tinyos/util’
… /opt/tinyos-2.x/support/java/net/tinyos/util
javac Messenger.java
make[3]: javac: Command not found
../../../Makefile.include:47: recipe for target ‘Messenger.class’ failed
make[3]: *** [Messenger.class] Error 127
make[3]: Leaving directory ‘/opt/tinyos-2.x/support/java/net/tinyos/util’
../../Makefile.include:57: recipe for target ‘subdirs’ failed
make[2]: *** [subdirs] Error 2
make[2]: Leaving directory ‘/opt/tinyos-2.x/support/java/net/tinyos’
../Makefile.include:57: recipe for target ‘subdirs’ failed
make[1]: *** [subdirs] Error 2
make[1]: Leaving directory ‘/opt/tinyos-2.x/support/java/net’
Makefile.include:57: recipe for target ‘subdirs’ failed
make: *** [subdirs] Error 2

Advertisements
 
Leave a comment

Posted by on June 13, 2014 in Uncategorized

 

Tags: , , , ,

Leave a Reply

Fill in your details below or click an icon to log in:

WordPress.com Logo

You are commenting using your WordPress.com account. Log Out / Change )

Twitter picture

You are commenting using your Twitter account. Log Out / Change )

Facebook photo

You are commenting using your Facebook account. Log Out / Change )

Google+ photo

You are commenting using your Google+ account. Log Out / Change )

Connecting to %s

 
%d bloggers like this: